{"text_format":"1","workbook":"xlsx","n_sheets":7,"sheets":["Aanvraag inhuur","Kwaliteitsraamwerk I(v)","Hulp bij invullen","Kwaliteitsraamwerk I(v) Info","Info VOG Items","Rapportage Info","Brongegevens dienst"],"not_rendered":{"charts":0,"images":3,"macros":1,"external_links":0,"defined_names":25,"comments":1,"pivot_tables":0},"unopened":[],"bounds":{"document_bytes":16777216,"sheet_cells":100000,"rows_first":2000,"rows_last":500,"rows_between":2000,"halvings":0,"cell_chars":16384,"cell_head_chars":4096},"cells_cut":0,"cells_raw":0,"read":"whole","date_system":"1900"}

{"sheet":"Aanvraag inhuur","index":0,"n_rows":152,"n_cols":14,"rows_kept":152,"cut":false,"hidden":false,"merged":[[48,0,48,8],[51,3,53,7],[59,2,59,7],[56,2,56,7],[4,3,6,7],[2,3,2,5],[31,1,31,5],[40,2,40,7],[31,7,31,8],[16,1,16,2],[17,1,17,2],[18,1,18,2],[12,0,12,1],[8,3,10,8],[12,3,12,5],[12,6,12,7],[95,5,95,7],[78,0,81,0],[82,7,83,7],[85,1,85,5],[86,1,86,5],[87,1,87,5],[78,2,78,7],[83,1,83,5],[84,1,84,5],[91,1,94,7],[101,0,104,0],[110,7,115,7],[107,0,107,3],[110,3,113,3],[111,4,113,5],[0,3,0,5],[96,0,99,0],[91,0,94,0],[49,0,49,1],[55,2,55,7],[24,1,24,7],[26,1,26,7],[28,1,28,7],[29,1,29,7],[52,1,52,2],[53,1,53,2],[70,2,70,8],[68,1,68,7],[79,2,79,7],[80,2,80,7],[81,2,81,7],[96,1,99,7],[128,3,128,8],[50,3,50,7],[58,2,58,7],[62,1,62,7],[72,2,72,7],[73,2,73,7],[74,2,74,7],[71,2,71,7],[64,1,64,7],[75,2,75,7],[77,2,77,7],[57,2,57,7],[110,6,115,6],[60,2,60,7],[101,1,104,7],[136,2,136,7],[132,5,132,6],[148,3,148,4],[130,3,130,7],[140,5,142,7],[140,3,142,4],[134,3,134,4],[132,3,133,4],[131,5,131,7],[133,5,134,6],[125,6,125,7],[125,3,125,5],[128,1,128,2],[129,3,129,4],[129,5,129,7],[127,3,127,7],[120,2,120,7],[118,2,118,7],[114,3,115,3],[120,0,120,1],[118,0,118,1]]}
["Aanvraag Inhuur ICT",null,"Referentienummer\n(wordt ingevuld door inhuurdesk)",null,null,null,null,{"$f":"'Brongegevens dienst'!B12","v":"5.03"}]
[{"$f":"CONCATENATE(\"AV\",D1)","v":"AV"},{"$f":"VLOOKUP(B18,'Brongegevens dienst'!D3:G12,4,FALSE)","v":{"$error":"#N/A"}},{"$f":"CONCATENATE(\"RI\",D1)","v":"RI"},null,null,null,{"$f":"'Brongegevens dienst'!A10","v":"K:\\5 Inkooptrajecten\\5.7 Inhuur\\ICT\\"},null,{"$f":"'Brongegevens dienst'!A10","v":"K:\\5 Inkooptrajecten\\5.7 Inhuur\\ICT\\"}]
["Ongewijzigde herhalingsaanvraag*","Nee","è Indien ja, gebaseerd op referentienummer",null,null,null,null,"!IUC-N",{"$f":"CONCATENATE(\"AV\",D1)","v":"AV"}]
[null,null,{"$f":"IF(B4=\"Perceel 1\", \"Soort1\",\"Soort2\")","v":"Soort2"},null,null,null,null,null,{"$f":"'Brongegevens dienst'!A12","v":"Versienummer formulier"}]
["Soort Aanvraag*","Regulier","è Toelichting  aanvraag",null,null,null,null,null,{"$f":"'Brongegevens dienst'!A10","v":"K:\\5 Inkooptrajecten\\5.7 Inhuur\\ICT\\"}]
["Eventueel maximum uurtarief"]
{"$rows_left_out":147}
{"sheet":"Kwaliteitsraamwerk I(v)","index":1,"n_rows":62,"n_cols":33,"rows_kept":62,"cut":false,"hidden":true,"merged":[]}
["Hoofgroep","Plannen","Bouwen","Uitvoeren","Mogelijk maken","Sturen","Kwaliteitenprofielen","PK1","C1","PK2","C2","PK3","C3","PK4","C4","PK5","C5","PK6","C6","Functiefamilie 1","Functiegroep 1","Schaal 1","Competenties 1","Functiefamilie 2","Functiegroep 2","Schaal 2","Competenties 2","Functiefamilie 3","Functiegroep 3","Schaal 3","Competenties 3","Toelichting","Voorbeelden van opleidingen"]
["Plannen","1.1.1 INFORMATIEARCHITECTUUR ","2.1.1 APPLICATIEONTWIKKELING ","3.1.1 SYSTEEMBEHEER ","4.1.1 SECURITYMANAGEMENT ","5.1.1 PROJECTLEIDERSCHAP I(V)","1.1.1 INFORMATIEARCHITECTUUR ","Bestuurlijke informatica","Bachelor Bedrijfskundige Informatica","Architectuur (methoden, modelleer-technieken, tools, modellen, etc.)","TOGAF Practitioner; NORA (geen certificering); MARIJ (geen certificering); SCIA, ERIA, basisopleiding architectuur Belastingdienst; DIVA (Defensie), Archimate Foundation & Practitioner","Informatiemanagement","Informatiemanagement"," "," "," "," "," "," ","Bedrijfsvoering","Senior Adviseur Bedrijfsvoering","11-13","analyseren, creativiteit, netwerken, omgevingsbewustzijn, organisatiesensitiviteit, overtuigingskracht, plannen en organiseren","Uitvoering","Expert I(v)","11-13","analyseren, creativiteit, netwerken, omgevingsbewustzijn, organisatiesensitiviteit, overtuigingskracht, plannen en organiseren, resultaatgerichtheid"," ",null,null,null,"De informatiearchitect stelt - uitgaande van de principes van architectuur - de informatiearchitectuur op en beheert die architectuur (bijvoorbeeld gelet op gewijzigde informatiebehoeften van gebruikers). De informatiearchitectuur is de structuur van applicaties, databases en andere (data)gegevens verzamelingen (ook die in de niet-geautomatiseerde of in persoonlijke applicaties (zoals spreadsheets) opgenomen zijn.  Bovendien worden de beleidsregels met betrekking tot het beheer van de (elementen van de) informatiearchitectuur opgesteld en beheerd. Een belangrijk aspect van deze functie is de integratie van informatiesystemen en (data) gegevens in een organisatie. Hoewel een datamanager meestal verantwoordelijk is voor het beheer van het bedrijfsdatamodel wordt dit voor de invulling van dit model vaak bij de data- of informatiearchitect belegd.","Information Security Foundation based on ISO/IEC 27002, Ontwikkeling Informatiesystemen Foundation"]
["Bouwen","1.1.2 FUNCTIONEEL ONTWERP / STARTARCHITECTUUR","2.1.2 SYSTEEMONTWIKKELING ","3.1.2 CHANGEMANAGEMENT ","4.1.2 INFORMATIE RISICOMANAGEMENT","5.1.2 PROJECTMANAGEMENT I(V)","1.1.2 FUNCTIONEEL ONTWERP / STARTARCHITECTUUR","Proces Modelleren en Analyseren","ARIS; Mavin, BiZZ designer","Bedrijfsregels modelleren","Business Rules Modeling Foundation Course"," "," "," "," "," "," "," "," ","Bedrijfsvoering","Adviseur Bedrijfsvoering","8-11","analyseren, klantgerichtheid, omgevingsbewustzijn, plannen en organiseren, samenwerken, voortgangscontrole, zelfontwikkeling","Uitvoering","Senior Medewerker Iv","8-11","analyseren, klantgerichtheid, omgevingsbewustzijn, plannen en organiseren, resultaatgerichtheid, samenwerken, voortgangscontrole, zelfontwikkeling"," ",null,null,null,"De functioneel ontwerper is gespecialiseerd in het opstellen van ontwerpen voor nieuwe informatiesystemen. Hij stelt samen met gebruikers en de opdrachtgever de functionele specificaties op waaraan een informatiesysteem moet voldoen. De functioneel ontwerper stelt het ontwerp op (mede) op basis van de input van een informatieanalist en of business analist die specifiek de eisen aan informatie bij de gebruikers analyseert en vaststelt (en modelleert). Het beheer en onderhoud van een informatiesysteem ligt meestal bij een functioneel beheerder en/of een applicatiebeheerder. De functioneel ontwerper levert ook een bijdrage aan testplannen voor functionele en acceptatie testen.","NORA, MARIJ (geen certificering), Ontwerp en Ontwikkeling Informatiesystemen Foundation; RAD/LAD; XML/UML; XBRL, Java; C#; .Net; Visual Basic; SAP/ERP; Cobol, Oracle; Databases en SQL Foundation; Objectoriëntatie Foundation, Testen Foundation; TMapNEXT Foundation"]
["Uitvoeren","1.1.3 APPLICATIEARCHITECTUUR","2.1.3 NETWERKONTWIKKELING ","3.1.3 FUNCTIONEEL BEHEER ","4.1.3 CYBER SECURITYMANAGEMENT ","5.1.3 PROGRAMMAMANAGEMENT I(V)","1.1.3 APPLICATIEARCHITECTUUR","Bestuurlijke informatica","Bachelor Bedrijfskundige Informatica","Architectuur (methoden, modelleer-technieken, tools, modellen, etc.)","TOGAF Practitioner; NORA (geen certificering); MARIJ (geen certificering); ERIA, basisopleiding architectuur Belastingdienst; DIVA (Defensie) Archimate Foundation & Practitioner","Informatiemanagement","Business Information Management Foundation"," "," "," "," "," "," ","Bedrijfsvoering","Senior Adviseur Bedrijfsvoering","11-13","analyseren, creativiteit, netwerken, omgevingsbewustzijn, organisatiesensitiviteit, overtuigingskracht, plannen en organiseren","Uitvoering","Expert I(v)","11-13","analyseren, creativiteit, netwerken, omgevingsbewustzijn, organisatiesensitiviteit, overtuigingskracht, plannen en organiseren, resultaatgerichtheid"," ",null,null,null,"De applicatie- of softwarearchitect draagt zorg voor het ontwerp van de architectuur van een totaal softwaresysteem en/of individuele applicaties en het technisch ontwerp daarvan. Hij werkt daarbij vanuit de principes van de architectuur (Nora - Gemma etc.). Deze functie komt voor in organisaties waar grote en complexe systemen worden ontwikkeld, bij de ontwikkeling van administratieve systemen en ook bij de ontwikkeling van embedded software.","Java; C#; .Net; Visual Basic; SAP/ERP; Groupware/Lotus Notes; Powerbuilder/Sybase; Cobol/Cics/DB2; Cool Gen, Information Security Foundation based on ISO/IEC 27002, Ontwikkeling Informatiesystemen Foundation, Applicatiemanagement Foundation"]
["Mogelijk maken","1.1.4 TECHNISCHE ARCHITECTUUR","2.1.4 DATA ENGINEERING","3.1.4 SERVERBEHEER","4.2.1 CATEGORIEMANAGEMENT I(V)","5.1.4 PORTFOLIOMANAGEMENT ","1.1.4 TECHNISCHE ARCHITECTUUR","Bestuurlijke Informatica","Bachelor Bedrijfskundige Informatica","Architectuur (methoden, modelleer-technieken, tools, modellen, etc.)","TOGAF Practitioner; NORA (geen certificering); MARIJ (geen certificering); SCIA, ERIA, basisopleiding architectuur Belasting- dienst; DIVA (Defensie) Archimate Foundation & Practitioner","Informatiemanagement","Business Information Management Foundation","Servicemanagement","Professional ITSM Service Delivery"," "," "," "," ","Bedrijfsvoering","Senior Adviseur Bedrijfsvoering","11-13","analyseren, creativiteit, netwerken, omgevingsbewustzijn, organisatiesensitiviteit, overtuigingskracht, plannen en organiseren","Uitvoering","Expert I(v)","11-13","analyseren, creativiteit, netwerken, omgevingsbewustzijn, organisatiesensitiviteit, overtuigingskracht, plannen en organiseren, resultaatgerichtheid"," ",null,null,null,"De technische architect (o.a. infrastructuur) ontwerpt - op basis van architectuurprincipes - de (overall) structuur van de technische infrastructuur (netwerk, servers, storage). Deze architectuur van de technische infrastructuur moet worden gebaseerd op de informatiearchitectuur. Het automatiseringsbeleid en automatiseringsplannen. Hierbij wordt niet alleen een structuur ontworpen, maar vaak ook de eisen die aan de componenten van de technische infrastructuur worden gesteld, zoals eisen aan passieve en actieve netwerkcomponenten (ook multimedia), systeemsoftware (operatingsystemen en middleware), de netwerk(beheer) software, servers en server(beheer)software en storage.","Information Security Foundation based on ISO/IEC 27002, ITSM Foundation; ITIL Foundation   "]
["Sturen","1.1.5 SYSTEEM ARCHITECTUUR ","2.2.1 TESTMANAGEMENT ","3.1.5 NETWERKBEHEER ","4.2.2 INKOOP I(V) ","5.2.1 SCRUM MASTER ","1.1.5 SYSTEEM ARCHITECTUUR ","Bestuurlijke Informatica","Bachelor Bedrijfskundige Informatica","Architectuur (methoden, modelleer-technieken, tools, modellen, etc.)","TOGAF Practitioner; NORA (geen certificering); MARIJ (geen certificering); SCIA, ERIA, basisopleiding architectuur Belasting- dienst; DIVA (Defensie) Archimate Foundation & Practitioner","Informatiemanagement","Business Information Management Foundation","Servicemanagement","Professional ITSM Service Delivery"," "," "," "," ","Bedrijfsvoering","Senior Adviseur Bedrijfsvoering","11-13","analyseren, creativiteit, netwerken, omgevingsbewustzijn, organisatiesensitiviteit, overtuigingskracht, plannen en organiseren","Uitvoering","Expert I(v)","11-13","analyseren, creativiteit, netwerken, omgevingsbewustzijn, organisatiesensitiviteit, overtuigingskracht, plannen en organiseren, resultaatgerichtheid"," ",null,null,null,"De System Architect is een functie die met name in het Scaled Agile Framework voorkomt. Hij/zij is verantwoordelijk voor het opstellen van de Architectural Features op programma niveau. Hij/zij overziet het gehele domein in technische zin. In die hoedanigheid is dit een belangrijke schakel tussen de product of domeinvisie aan de ene kant, en de benodigde aanpassingen aan het domein specifieke IT landschap die realisatie van deze visie ondersteunen anderzijds. Om te komen tot realisatie van de corporate doelen op het gebied van convergentie en ondersteunen van de strategie vertaald de System Architect de Corporate Architectural Epics in Architectural Features. Deze vult hij/zij aan met eventuele lokaal benodigde architectural features. De System Architect is een belangrijke sparringpartner voor de Product Manager en Product Owners. Hij/zij zal moeten onderhandelen en bedingen welke architectural features gerealiseerd dienen te worden, alvorens de business features gerealiseerd kunnen worden. Vaak moet de fundering eerst worden versterkt, eer er op voortgebouwd kan worden. Dit noemt SAFe de 'Architectural Runway'. In deze hoedanigheid maakt de System Architect deel uit van het Product Management Team.","Information Security Foundation based on ISO/IEC 27002, ITSM Foundation; ITIL Foundation, SAFe Agilist, Leading SAFE Agile voor Lead engineers  "]
{"$rows_left_out":57}
{"sheet":"Hulp bij invullen","index":2,"n_rows":26,"n_cols":8,"rows_kept":26,"cut":false,"hidden":false,"merged":[[12,2,19,5],[4,7,10,8],[21,2,23,5],[25,2,26,5],[0,0,0,1],[4,2,5,5],[7,2,10,5]]}
["Aanvragen juist in de markt plaatsen"]
[]
["1. Enkelvoudige reguliere aanvraag  zonder extra opties?",null,"Ga naar stap 3",null,null,null,null,"Niet doen bij het invullen van aanvragen ICT Inhuur!!"]
[]
["2. Meerdere FTE's nodig?",null,"In negen van de tien gevallen gewoon als reguliere aanvraag zonder extra opties. \n\nLet wel op dat de eisen in proportie blijven (werk en denkniveau i.p.v. diploma, aantal jaren ervaring van iemand die iets dedicated heeft gedaan kan lager. Vermijdt ook ervaringseisen gerelateerd aan een specifieke klant). ",null,null,null,null,"Teveel Fte’s op 1 aanvraag. Geef leveranciers de ruimte meer cv’s in te dienen en voeg de regel toe: ‘in geval meerdere kandidaten geschikt worden bevonden, behoudt de dienst zich het recht voor meerdere gunningen te doen.’\n\nOp de aanvraag aangeven dat het om een aangewezen / gerede kandidaat of warme stoel gaat. De ADR verklaart dit onrechtmatig!\n\nVerambtelijken zonder de nog lopende nok te respecteren!\n\nWensen als eis opnemen! Bijv. Bij voorkeur heeft de kandidaat…. Dit suggereert een wens en moet dan ook als wens worden genoteerd.\n\nTelefonisch toelichting geven aan een opdrachtnemer zonder dit ook te delen met de andere opdrachtnemers."]
[]
{"$rows_left_out":21}
{"sheet":"Kwaliteitsraamwerk I(v) Info","index":3,"n_rows":62,"n_cols":3,"rows_kept":62,"cut":false,"hidden":false,"merged":[]}
["Kwaliteitenprofielen","Toelichting","Voorbeelden van opleidingen"]
["1.1.1 INFORMATIEARCHITECTUUR ","De informatiearchitect stelt - uitgaande van de principes van architectuur - de informatiearchitectuur op en beheert die architectuur (bijvoorbeeld gelet op gewijzigde informatiebehoeften van gebruikers). De informatiearchitectuur is de structuur van applicaties, databases en andere (data)gegevens verzamelingen (ook die in de niet-geautomatiseerde of in persoonlijke applicaties (zoals spreadsheets) opgenomen zijn.  Bovendien worden de beleidsregels met betrekking tot het beheer van de (elementen van de) informatiearchitectuur opgesteld en beheerd. Een belangrijk aspect van deze functie is de integratie van informatiesystemen en (data) gegevens in een organisatie. Hoewel een datamanager meestal verantwoordelijk is voor het beheer van het bedrijfsdatamodel wordt dit voor de invulling van dit model vaak bij de data- of informatiearchitect belegd.","Information Security Foundation based on ISO/IEC 27002, Ontwikkeling Informatiesystemen Foundation"]
["1.1.2 FUNCTIONEEL ONTWERP / STARTARCHITECTUUR","De functioneel ontwerper is gespecialiseerd in het opstellen van ontwerpen voor nieuwe informatiesystemen. Hij stelt samen met gebruikers en de opdrachtgever de functionele specificaties op waaraan een informatiesysteem moet voldoen. De functioneel ontwerper stelt het ontwerp op (mede) op basis van de input van een informatieanalist en of business analist die specifiek de eisen aan informatie bij de gebruikers analyseert en vaststelt (en modelleert). Het beheer en onderhoud van een informatiesysteem ligt meestal bij een functioneel beheerder en/of een applicatiebeheerder. De functioneel ontwerper levert ook een bijdrage aan testplannen voor functionele en acceptatie testen.","NORA, MARIJ (geen certificering), Ontwerp en Ontwikkeling Informatiesystemen Foundation; RAD/LAD; XML/UML; XBRL, Java; C#; .Net; Visual Basic; SAP/ERP; Cobol, Oracle; Databases en SQL Foundation; Objectoriëntatie Foundation, Testen Foundation; TMapNEXT Foundation"]
["1.1.3 APPLICATIEARCHITECTUUR","De applicatie- of softwarearchitect draagt zorg voor het ontwerp van de architectuur van een totaal softwaresysteem en/of individuele applicaties en het technisch ontwerp daarvan. Hij werkt daarbij vanuit de principes van de architectuur (Nora - Gemma etc.). Deze functie komt voor in organisaties waar grote en complexe systemen worden ontwikkeld, bij de ontwikkeling van administratieve systemen en ook bij de ontwikkeling van embedded software.","Java; C#; .Net; Visual Basic; SAP/ERP; Groupware/Lotus Notes; Powerbuilder/Sybase; Cobol/Cics/DB2; Cool Gen, Information Security Foundation based on ISO/IEC 27002, Ontwikkeling Informatiesystemen Foundation, Applicatiemanagement Foundation"]
["1.1.4 TECHNISCHE ARCHITECTUUR","De technische architect (o.a. infrastructuur) ontwerpt - op basis van architectuurprincipes - de (overall) structuur van de technische infrastructuur (netwerk, servers, storage). Deze architectuur van de technische infrastructuur moet worden gebaseerd op de informatiearchitectuur. Het automatiseringsbeleid en automatiseringsplannen. Hierbij wordt niet alleen een structuur ontworpen, maar vaak ook de eisen die aan de componenten van de technische infrastructuur worden gesteld, zoals eisen aan passieve en actieve netwerkcomponenten (ook multimedia), systeemsoftware (operatingsystemen en middleware), de netwerk(beheer) software, servers en server(beheer)software en storage.","Information Security Foundation based on ISO/IEC 27002, ITSM Foundation; ITIL Foundation   "]
["1.1.5 SYSTEEM ARCHITECTUUR ","De System Architect is een functie die met name in het Scaled Agile Framework voorkomt. Hij/zij is verantwoordelijk voor het opstellen van de Architectural Features op programma niveau. Hij/zij overziet het gehele domein in technische zin. In die hoedanigheid is dit een belangrijke schakel tussen de product of domeinvisie aan de ene kant, en de benodigde aanpassingen aan het domein specifieke IT landschap die realisatie van deze visie ondersteunen anderzijds. Om te komen tot realisatie van de corporate doelen op het gebied van convergentie en ondersteunen van de strategie vertaald de System Architect de Corporate Architectural Epics in Architectural Features. Deze vult hij/zij aan met eventuele lokaal benodigde architectural features. De System Architect is een belangrijke sparringpartner voor de Product Manager en Product Owners. Hij/zij zal moeten onderhandelen en bedingen welke architectural features gerealiseerd dienen te worden, alvorens de business features gerealiseerd kunnen worden. Vaak moet de fundering eerst worden versterkt, eer er op voortgebouwd kan worden. Dit noemt SAFe de 'Architectural Runway'. In deze hoedanigheid maakt de System Architect deel uit van het Product Management Team.","Information Security Foundation based on ISO/IEC 27002, ITSM Foundation; ITIL Foundation, SAFe Agilist, Leading SAFE Agile voor Lead engineers  "]
{"$rows_left_out":57}
{"sheet":"Info VOG Items","index":4,"n_rows":43,"n_cols":2,"rows_kept":43,"cut":false,"hidden":false,"merged":[]}
[null,"VOG Overzicht Items"]
[]
[null,"Specifiek screeningsprofiel"]
["01","Politieke ambtsdragers"]
["06","Visum en emigratie"]
["25","(Buitengewoon) opsporingsambtenaar"]
{"$rows_left_out":38}
{"sheet":"Rapportage Info","index":5,"n_rows":12,"n_cols":16,"rows_kept":12,"cut":false,"hidden":true,"merged":[[0,0,0,2],[2,0,2,3],[3,0,3,3],[3,4,3,5]]}
["Rapportagegegevens Inhuur Aanvraag ICT",null,null,"Referentienummer",{"$f":"'Aanvraag inhuur'!D1","v":0}]
[]
["U kunt de ingevulde rubrieken overnemen (Kopiëren/Plakken) op uw rapportagewerkblad"]
["Voor vragen kunt u contact opnemen met de contractmanager bereikbaar via :",null,null,null,{"$f":"'Brongegevens dienst'!B20","v":"iuc-inhuur@iuc-noord.nl"}]
[]
["INFORMATIE VOOR RAPPORTAGE OPDRACHTNEMERS"]
{"$rows_left_out":7}
{"sheet":"Brongegevens dienst","index":6,"n_rows":42,"n_cols":24,"rows_kept":42,"cut":false,"hidden":true,"merged":[[0,17,0,23],[10,0,10,1],[0,0,0,1],[0,2,0,4],[0,7,0,16],[1,0,1,1],[9,0,9,1],[1,18,1,22]]}
["Aanvraagopties",null,"ORGANISATIE",null,null,null,null,"FEESTDAGEN",null,null,null,null,null,null,null,null,null,"LEVERANCIERSINFORMATIE"]
["Bij meerdere geschikte kandidaten behoudt de dienst zich het recht voor om meerdere gunningen te doen.",null,"Departement","Deelnemende dienst","Algemene tekst dienst","Emailadres Inhuurdesk","Pad","Jaar","1e Paasdag","2e Paasdag","Hemelvaartsdag","Koningsdag","1e Pinksterdag","2e Pinksterdag","1e Kerstdag","2e Kertsdag","Nieuwjaar","LevP1","Worden niet gebruikt door dienst. \nWel laten staan.",null,null,null,null,"Email-adres"]
[null,null,"Ministerie van Onderwijs, Cultuur en Wetenschap","Adviesraad voor wetenschap, technologie en innovatie","De Adviesraad voor wetenschap, technologie en innovatie (AWTI) is de onafhankelijke adviesraad van de regering en het parlement op het terrein van wetenschap, technologie en innovatie. Met zijn strategische beleidsadviezen wil de AWTI bijdragen aan het versterken van de innovatieve, wetenschappelijke en technologische kracht van mensen, bedrijven en kennisinstellingen in Nederland.  En daarmee aan een toekomstbestendige Nederlandse economie en samenleving.","iuc-inhuur@iuc-noord.nl","K:\\5 Inkooptrajecten\\5.7 Inhuur\\ICT\\NA-OR-RvC-AWTI\\",2016,{"$f":"FIXED((\"4/\"&H3)/7+MOD(MOD(H3,19)*19-7,30)*14%,0)*7-6","v":42456},{"$f":"I3+1","v":42457},{"$f":"I3+39","v":42495},42487,{"$f":"I3+49","v":42505},{"$f":"I3+50","v":42506},{"$f":"DATE(H3,12,25)","v":42729},{"$f":"DATE(H3,12,26)","v":42730},{"$f":"DATE(H3,1,1)","v":42370},"Cimsolutions en SLTN"]
[null,null,null,"Bestuursdepartement","OCW bestaat uit een bestuursdepartement en tien daarbuiten gepositioneerde dienstonderdelen Het bestuursdepartement ontwikkelt het beleid op de terreinen onderwijs, cultuur en wetenschap. ","iuc-inhuur@iuc-noord.nl","K:\\5 Inkooptrajecten\\5.7 Inhuur\\ICT\\BD-EGI\\",2017,{"$f":"FIXED((\"4/\"&H4)/7+MOD(MOD(H4,19)*19-7,30)*14%,0)*7-6","v":42841},{"$f":"I4+1","v":42842},{"$f":"I4+39","v":42880},42852,{"$f":"I4+49","v":42890},{"$f":"I4+50","v":42891},{"$f":"DATE(H4,12,25)","v":43094},{"$f":"DATE(H4,12,26)","v":43095},{"$f":"DATE(H4,1,1)","v":42736},"Headfirst"]
["Lijst 1","Lijst 2",null,"DUO Den Haag","DUO verzorgt als uitvoeringsorganisatie, zijnde onderdeel van het Ministerie van Onderwijs, Cultuur en Wetenschap de uitvoering van complexe wet- en regelgeving en heeft een uitgebreid dienstenpakket. DUO financiert en informeert onderwijsdeelnemers en onderwijsinstellingen. Voor verdere informatie zie www.duo.nl","iuc-inhuur@iuc-noord.nl","K:\\5 Inkooptrajecten\\5.7 Inhuur\\ICT\\DUO-DH\\",2018,43191,43192,43230,43217,43240,43241,43459,43460,43101,"Itaq"]
["Ja","Ja",null,"Inspectie Overheidsinformatie en Erfgoed","De Inspectie Overheidsinformatie en Erfgoed (voorheen Erfgoedinspectie) houdt toezicht op een deel van het Nederlandse erfgoed en op het informatiebeheer bij de Rijksoverheid. Ook levert de inspectie een belangrijke bijdrage aan het tegengaan van illegale handel in cultuurgoederen. De Inspectie draagt zo bij aan het behoud en beheer van het nationale erfgoed.","iuc-inhuur@iuc-noord.nl","K:\\5 Inkooptrajecten\\5.7 Inhuur\\ICT\\BD-EGI\\",2019,43576,43577,43615,null,43625,43626,43824,43825,43466,"Linkit"]
{"$rows_left_out":36}