{"text_format":"1","workbook":"xlsx","n_sheets":7,"sheets":["Aanvraag inhuur","Kwaliteitsraamwerk I(v)","Hulp bij invullen","Kwaliteitsraamwerk IV Info","Info VOG Items","Rapportage Info","Brongegevens dienst"],"not_rendered":{"charts":0,"images":3,"macros":1,"external_links":0,"defined_names":28,"comments":1,"pivot_tables":0},"unopened":[],"bounds":{"document_bytes":16777216,"sheet_cells":100000,"rows_first":2000,"rows_last":500,"rows_between":2000,"halvings":0,"cell_chars":16384,"cell_head_chars":4096},"cells_cut":0,"cells_raw":0,"read":"whole","date_system":"1900"}

{"sheet":"Aanvraag inhuur","index":0,"n_rows":140,"n_cols":14,"rows_kept":140,"cut":false,"hidden":false,"merged":[[110,2,110,7],[106,3,107,3],[110,0,110,1],[69,3,69,8],[77,1,77,7],[78,1,78,7],[79,1,79,7],[80,1,80,7],[89,1,92,7],[73,2,73,7],[74,2,74,7],[76,2,76,7],[103,6,107,6],[94,1,97,7],[94,0,97,0],[103,7,107,7],[115,6,115,7],[115,3,115,5],[118,1,118,2],[119,3,119,4],[117,3,117,7],[116,1,116,2],[118,3,118,8],[126,2,126,7],[122,5,122,6],[137,3,137,4],[120,3,120,7],[130,5,132,7],[130,3,132,4],[124,3,124,4],[122,3,123,4],[121,5,121,7],[123,5,124,6],[0,3,0,5],[89,0,92,0],[84,0,87,0],[48,0,48,1],[54,2,54,7],[23,1,23,7],[25,1,25,7],[27,1,27,7],[28,1,28,7],[51,1,51,2],[52,1,52,2],[67,1,67,7],[88,5,88,7],[77,0,80,0],[84,1,87,7],[2,3,2,5],[100,0,100,3],[103,3,105,3],[103,4,105,5],[30,1,30,5],[39,2,39,7],[30,7,30,8],[49,3,49,7],[57,2,57,7],[61,1,61,7],[71,2,71,7],[72,2,72,7],[70,2,70,7],[63,1,63,7],[56,2,56,7],[59,2,59,7],[4,3,5,7],[47,0,47,8],[50,3,52,7],[58,2,58,7],[55,2,55,7],[46,3,46,7],[15,1,15,2],[16,1,16,2],[17,1,17,2],[11,0,11,1],[7,3,9,8],[11,3,11,5],[11,6,11,7]]}
["Aanvraag Inhuur ICT-Professionals Detavast",null,"Referentienummer\n(wordt ingevuld door inhuurdesk)",null,null,null,null,{"$f":"'Brongegevens dienst'!B12","v":"1.1"}]
[{"$f":"CONCATENATE(\"AV\",D1)","v":"AV"},{"$f":"VLOOKUP(B17,'Brongegevens dienst'!D3:G13,4,FALSE)","v":{"$error":"#N/A"}},{"$f":"CONCATENATE(\"RI\",D1)","v":"RI"},null,null,null,{"$f":"'Brongegevens dienst'!A10","v":"K:\\5 Inkooptrajecten\\5.7 Inhuur\\ICT\\"},null,{"$f":"'Brongegevens dienst'!A10","v":"K:\\5 Inkooptrajecten\\5.7 Inhuur\\ICT\\"}]
["Ongewijzigde herhalingsaanvraag*","Nee","è Indien ja, gebaseerd op referentienummer",null,null,null,null,"!IUC-N",{"$f":"CONCATENATE(\"AV\",D1)","v":"AV"}]
[null,null,{"$f":"IF(B4=\"Perceel 1\", \"Soort1\",\"Soort2\")","v":"Soort2"},null,null,null,null,null,{"$f":"'Brongegevens dienst'!A12","v":"Versienummer formulier"}]
["Soort Aanvraag*","Regulier","è Toelichting  aanvraag",null,null,null,null,null,{"$f":"'Brongegevens dienst'!A10","v":"K:\\5 Inkooptrajecten\\5.7 Inhuur\\ICT\\"}]
["Eventueel maximum uurtarief"]
{"$rows_left_out":135}
{"sheet":"Kwaliteitsraamwerk I(v)","index":1,"n_rows":62,"n_cols":33,"rows_kept":62,"cut":false,"hidden":true,"merged":[]}
["EZ_CCM","Plannen","Bouwen","Uitvoeren","Mogelijk maken","Sturen","Kwaliteitenprofielen","PK1","C1","PK2","C2","PK3","C3","PK4","C4","PK5","C5","PK6","C6","Functiefamilie 1","Functiegroep 1","Schaal 1","Competenties 1","Functiefamilie 2","Functiegroep 2","Schaal 2","Competenties 2","Functiefamilie 3","Functiegroep 3","Schaal 3","Competenties 3","Toelichting","Voorbeelden van opleidingen"]
["Plannen","1.1.1 Informatiearchitectuur","2.1.1 Applicatieontwikkeling","3.1.1 Systeembeheer","4.1.1 Security Management","5.1.1 Projectleiderschap Iv","1.1.1 Informatiearchitectuur","Bestuurlijke informatica","Bachelor Bedrijfskundige Informatica","Architectuur (methoden, modelleer-technieken, tools, modellen, etc.)","TOGAF Practitioner; NORA; MARIJ (geen \ncertificering); SCIA, ERIA, basisopleiding \narchitectuur Belastingdienst; IDA (Defensie), \nArchimate Foundation & Practitioner","Informatiemanagement","Business Information Management Foundation"," "," "," "," "," "," ","Uitvoering","Expert IV","S11-13","analyseren, creativiteit, netwerken, omgevingsbewustzijn, organisatiesensitiviteit, overtuigingskracht, plannen en organiseren, resultaatgerichtheid","Bedrijfsvoering","Senior Adviseur Bedrijfsvoering","S11-13","analyseren, creativiteit, netwerken, omgevingsbewustzijn, organisatiesensitiviteit, overtuigingskracht, plannen en organiseren"," "," "," "," ","De informatiearchitect stelt – uitgaande van de principes van architectuur – de informatiearchitectuur op en beheert die architectuur (bijvoorbeeld gelet op gewijzigde informatiebehoeften van gebruikers). De informatiearchitectuur is de structuur van applicaties, databases en andere (data)gegevensverzamelingen (ook die in de niet-geautomatiseerde of in persoonlijke applicaties (zoals spreadsheets). Daarnaast worden de beleidsregels met betrekking tot het beheer van de (elementen van de) informatiearchitectuur opgesteld en beheerd. Een belangrijk aspect van deze rol is de integratie van informatiesystemen en (data) gegevens in een organisatie. Hoewel een datamanager meestal verantwoordelijk is voor het beheer van het bedrijfsdata model wordt dit voor de invulling van dit model vaak bij de data- of informatiearchitect belegd.","Informatiebeveiliging :  Information Security Foundation based on ISO/IEC 27002\nOntwikkeling informatiesystemen :  Ontwikkeling Informatiesystemen Foundation"]
["Bouwen","1.1.2 Functioneel Ontwerp/Startarchitectuur","2.1.2 Systeemontwikkeling","3.1.2 Change Management","4.1.2 Informatierisicomanagement","5.1.2 Projectmanagement Iv","1.1.2 Functioneel Ontwerp/Startarchitectuur","Proces Modelleren en Analyseren","ARIS; Mavin, BiZZ designer","Bedrijfsregels modelleren","Business Rules Modeling Foundation Course"," "," "," "," "," "," "," "," ","Uitvoering","Senior Medewerker IV","S8-11","analyseren, klantgerichtheid, omgevingsbewustzijn, plannen en organiseren, resultaatgerichtheid, samenwerken, voortgangscontrole, zelfontwikkeling","Bedrijfsvoering","Adviseur Bedrijfsvoering","S8-11","analyseren, klantgerichtheid, omgevingsbewustzijn, plannen en organiseren, samenwerken, voortgangscontrole, zelfontwikkeling"," "," "," "," ","De functioneel ontwerper is gespecialiseerd in het opstellen van ontwerpen voor nieuwe informatiesystemen. De functioneel ontwerper stelt samen met gebruikers en de opdrachtgever de functionele specificaties op waaraan een informatiesysteem moet voldoen. De functioneel ontwerper stelt het ontwerp op (mede) op basis van de input van een informatieanalist en/of business analist die specifiek de eisen aan informatie bij de gebruikers analyseert en vaststelt (en modelleert). Het beheer en onderhoud van een informatiesysteem ligt meestal bij een functioneel beheerder en/of een applicatiebeheerder. De functioneel ontwerper levert ook een bijdrage aan testplannen voor functionele en acceptatietesten.  ","Architectuur :  NORA, MARIJ (geen certificering)\nOntwikkeling van informatiesystemen :  Ontwerp en Ontwikkeling Informatiesystemen, Foundation; RAD/LAD; XML/UML; XBRL\nProgrammeren :  Java; C#; .Net; Visual Basic; SAP/ERP; Cobol; Python; PHP\nGegevensmodellering :  Oracle; Databases en SQL Foundation; Objectoriëntatie Foundation\nTesten :  Testen Foundation; TMapNEXT Foundation"]
["Uitvoeren","1.1.3 Applicatiearchitectuur","2.1.3 Netwerkontwikkeling","3.1.3 Functioneel Beheer","4.1.3 Cybersecurity Management","5.1.3 Programmamanagement Iv","1.1.3 Applicatiearchitectuur","Bestuurlijke informatica","Bachelor Bedrijfskundige Informatica","Architectuur (methoden, modelleer-technieken, tools, modellen, etc.)","TOGAF Practitioner; NORA; MARIJ (geen certificering); ERIA, basisopleiding architectuur \nBelastingdienst; IDA (Defensie) Archimate\nFoundation & Practitioner","Informatiemanagement","Business Information Management Foundation"," "," "," "," "," "," ","Uitvoering","Expert IV","S11-13","analyseren, creativiteit, netwerken, omgevingsbewustzijn, organisatiesensitiviteit, overtuigingskracht, plannen en organiseren, resultaatgerichtheid","Bedrijfsvoering","Senior Adviseur Bedrijfsvoering","S11-13","analyseren, creativiteit, netwerken, omgevingsbewustzijn, organisatiesensitiviteit, overtuigingskracht, plannen en organiseren"," "," "," "," ","De applicatie- of softwarearchitect draagt zorg voor het ontwerp van de architectuur van een totaal softwaresysteem en/of individuele applicaties en het technisch ontwerp daarvan. De applicatie- of softwarearchitect werkt daarbij vanuit de principes van de architectuur (Nora – Gemma etc.).  Deze rol komt voor in organisaties waar grote en complexe systemen worden ontwikkeld, bij de ontwikkeling van administratieve systemen en ook bij de ontwikkeling van embedded software.  ","Programmeren :   Java; C#; .Net; Visual Basic; SAP/ERP; Groupware/Lotus Notes; Powerbuil\u0002der/Sybase; Cobol/Cics/DB2; Cool Gen\nInformatiebeveiliging :  Information Security Foundation based on ISO/IEC 27002\nOntwikkeling informatiesystemen :  Ontwikkeling Informatiesystemen Foundation\nApplicatiemanagement :  Applicatiemanagement Foundation"]
["Mogelijk maken","1.1.4 Technische Architectuur","2.1.4 Data Engineering","3.1.4 Serverbeheer","4.2.1 Categoriemanagement Iv","5.1.4 Portfoliomanagement Iv","1.1.4 Technische Architectuur","Bestuurlijke Informatica","Bachelor Bedrijfskundige Informatica","Architectuur (methoden, modelleer-technieken, tools, modellen, etc.)","TOGAF Practitioner; NORA; MARIJ (geen \ncertificering); SCIA, ERIA, basisopleiding \narchitectuur Belastingdienst; IDA (Defensie) Archimate Foundation & Practitioner","Informatiemanagement","Business Information Management Foundation","Servicemanagement","Professional ITSM Service Delivery"," "," "," "," ","Uitvoering","Expert IV","S11-13","analyseren, creativiteit, netwerken, omgevingsbewustzijn, organisatiesensitiviteit, overtuigingskracht, plannen en organiseren, resultaatgerichtheid","Bedrijfsvoering","Senior Adviseur Bedrijfsvoering","S11-13","analyseren, creativiteit, netwerken, omgevingsbewustzijn, organisatiesensitiviteit, overtuigingskracht, plannen en organiseren"," "," "," "," ","De technische architect (o.a. infrastructuur) ontwerpt – op basis van architectuurprincipes – de (overall) structuur van de technische infrastructuur (netwerk, servers, storage). Deze architectuur van de technische infrastructuur moet worden gebaseerd op de informatiearchitectuur, het automatiseringsbeleid en de automatiseringsplannen. Hierbij wordt niet alleen een structuur ontworpen, maar moet ook aan de eisen worden voldaan die aan de componenten van de technische infrastructuur zijn gesteld, zoals: eisen aan passieve en actieve netwerkcomponenten (ook multimedia), systeemsoftware (operating systemen en middleware), de netwerk(beheer)software, servers, server(beheer)software en storage.","Informatiebeveiliging :   Information Security Foundation based on ISO/IEC 27002\nServicemanagement :  ITSM Foundation; ITIL Foundation"]
["Sturen","1.1.5 Systeemarchitectuur","2.2.1 Testmanagement","3.1.5 Netwerkbeheer","4.2.2 Inkoop Iv","5.2.1 Scrum Master","1.1.5 Systeemarchitectuur","Bestuurlijke Informatica","Bachelor Bedrijfskundige Informatica","Architectuur (methoden, modelleer-technieken, tools, modellen, etc.)","TOGAF Practitioner; NORA; MARIJ (geen certificering); SCIA, ERIA, basisopleiding \narchitectuur Belastingdienst; IDA (Defensie) \nArchimate Foundation & Practitioner","Informatiemanagement","Business Information Management Foundation","Servicemanagement","Professional ITSM Service Delivery"," "," "," "," ","Uitvoering","Expert IV","S11-13","analyseren, creativiteit, netwerken, omgevingsbewustzijn, organisatiesensitiviteit, overtuigingskracht, plannen en organiseren, resultaatgerichtheid","Bedrijfsvoering","Senior Adviseur Bedrijfsvoering","S11-13","analyseren, creativiteit, netwerken, omgevingsbewustzijn, organisatiesensitiviteit, overtuigingskracht, plannen en organiseren"," "," "," "," ","De systeem architect is een rol die met name in het Scaled Agile Framework voorkomt. De systeem architect is verantwoordelijk voor het opstellen van de architectural features op programma niveau. De systeem architect overziet het gehele domein in technische zin. In die hoedanigheid is dit een belangrijke schakel tussen de product- of domeinvisie, en de benodigde aanpassingen aan het specifieke IV-landschap die realisatie van deze visie ondersteunt. Om te komen tot realisatie van de corporate doelen op het gebied van convergentie en ondersteunen van de strategie, vertaalt de systeem architect de corporate architectural epics in architectural features. Deze vult hij/zij aan met eventuele lokaal benodigde architectural features. De systeem architect is een belangrijke sparringpartner voor de product manager en product owners. De systeem architect zal moeten onderhandelen en bedingen welke architectural features gerealiseerd dienen te worden, alvorens de business features gerealiseerd kunnen worden. Vaak moet de fundering eerst worden versterkt, voordat er op voortgebouwd kan worden. Dit noemt SAFe de ‘architectural runway’. In deze hoedanigheid maakt de systeem architect deel uit van het product management team. ","Informatiebeveiliging :  Information Security Foundation based on ISO/IEC 27002\nServicemanagement :  ITSM Foundation; ITIL Foundation\nScaled Agile Framework :  SAFe Agilist, Leading SAFE Agile voor Lead engineers"]
{"$rows_left_out":57}
{"sheet":"Hulp bij invullen","index":2,"n_rows":26,"n_cols":8,"rows_kept":26,"cut":false,"hidden":false,"merged":[[12,2,19,5],[4,7,10,8],[21,2,23,5],[25,2,26,5],[0,0,0,1],[4,2,5,5],[7,2,10,5]]}
["Aanvragen juist in de markt plaatsen"]
[]
["1. Enkelvoudige reguliere aanvraag  zonder extra opties?",null,"Ga naar stap 3",null,null,null,null,"Niet doen bij het invullen van aanvragen ICT Inhuur!!"]
[]
["2. Meerdere FTE's nodig?",null,"In negen van de tien gevallen gewoon als reguliere aanvraag zonder extra opties. \n\nLet wel op dat de eisen in proportie blijven (werk en denkniveau i.p.v. diploma, aantal jaren ervaring van iemand die iets dedicated heeft gedaan kan lager. Vermijdt ook ervaringseisen gerelateerd aan een specifieke klant). ",null,null,null,null,"Teveel Fte’s op 1 aanvraag. Geef leveranciers de ruimte meer cv’s in te dienen en voeg de regel toe: ‘in geval meerdere kandidaten geschikt worden bevonden, behoudt de dienst zich het recht voor meerdere gunningen te doen.’\n\nOp de aanvraag aangeven dat het om een aangewezen / gerede kandidaat of warme stoel gaat. De ADR verklaart dit onrechtmatig!\n\nVerambtelijken zonder de nog lopende nok te respecteren!\n\nWensen als eis opnemen! Bijv. Bij voorkeur heeft de kandidaat…. Dit suggereert een wens en moet dan ook als wens worden genoteerd.\n\nTelefonisch toelichting geven aan een opdrachtnemer zonder dit ook te delen met de andere opdrachtnemers."]
[]
{"$rows_left_out":21}
{"sheet":"Kwaliteitsraamwerk IV Info","index":3,"n_rows":62,"n_cols":3,"rows_kept":62,"cut":false,"hidden":false,"merged":[]}
["Kwaliteitenprofielen","Toelichting","Voorbeelden van opleidingen"]
["1.1.1 Informatiearchitectuur ","De informatiearchitect stelt – uitgaande van de principes van architectuur – de informatiearchitectuur op en beheert die architectuur (bijvoorbeeld gelet op gewijzigde informatiebehoeften van gebruikers). De informatiearchitectuur is de structuur van applicaties, databases en andere (data)gegevensverzamelingen (ook die in de niet-geautomatiseerde of in persoonlijke applicaties (zoals spreadsheets). Daarnaast worden de beleidsregels met betrekking tot het beheer van de (elementen van de) informatiearchitectuur opgesteld en beheerd. Een belangrijk aspect van deze rol is de integratie van informatiesystemen en (data) gegevens in een organisatie. Hoewel een datamanager meestal verantwoordelijk is voor het beheer van het bedrijfsdata model wordt dit voor de invulling van dit model vaak bij de data- of informatiearchitect belegd.","Informatiebeveiliging :  Information Security Foundation based on ISO/IEC 27002\nOntwikkeling informatiesystemen :  Ontwikkeling Informatiesystemen Foundation"]
["1.1.2 Functioneel Ontwerp / Startarchitectuur","De functioneel ontwerper is gespecialiseerd in het opstellen van ontwerpen voor nieuwe informatiesystemen. De functioneel ontwerper stelt samen met gebruikers en de opdrachtgever de functionele specificaties op waaraan een informatiesysteem moet voldoen. De functioneel ontwerper stelt het ontwerp op (mede) op basis van de input van een informatieanalist en/of business analist die specifiek de eisen aan informatie bij de gebruikers analyseert en vaststelt (en modelleert). Het beheer en onderhoud van een informatiesysteem ligt meestal bij een functioneel beheerder en/of een applicatiebeheerder. De functioneel ontwerper levert ook een bijdrage aan testplannen voor functionele en acceptatietesten.  ","Architectuur :  NORA, MARIJ (geen certificering)\nOntwikkeling van informatiesystemen :  Ontwerp en Ontwikkeling Informatiesystemen, Foundation; RAD/LAD; XML/UML; XBRL\nProgrammeren :  Java; C#; .Net; Visual Basic; SAP/ERP; Cobol; Python; PHP\nGegevensmodellering :  Oracle; Databases en SQL Foundation; Objectoriëntatie Foundation\nTesten :  Testen Foundation; TMapNEXT Foundation"]
["1.1.3 Applicatiearchitectuur","De applicatie- of softwarearchitect draagt zorg voor het ontwerp van de architectuur van een totaal softwaresysteem en/of individuele applicaties en het technisch ontwerp daarvan. De applicatie- of softwarearchitect werkt daarbij vanuit de principes van de architectuur (Nora – Gemma etc.).  Deze rol komt voor in organisaties waar grote en complexe systemen worden ontwikkeld, bij de ontwikkeling van administratieve systemen en ook bij de ontwikkeling van embedded software.  ","Programmeren :   Java; C#; .Net; Visual Basic; SAP/ERP; Groupware/Lotus Notes; Powerbuil\u0002der/Sybase; Cobol/Cics/DB2; Cool Gen\nInformatiebeveiliging :  Information Security Foundation based on ISO/IEC 27002\nOntwikkeling informatiesystemen :  Ontwikkeling Informatiesystemen Foundation\nApplicatiemanagement :  Applicatiemanagement Foundation"]
["1.1.4 Technische Architectuur","De technische architect (o.a. infrastructuur) ontwerpt – op basis van architectuurprincipes – de (overall) structuur van de technische infrastructuur (netwerk, servers, storage). Deze architectuur van de technische infrastructuur moet worden gebaseerd op de informatiearchitectuur, het automatiseringsbeleid en de automatiseringsplannen. Hierbij wordt niet alleen een structuur ontworpen, maar moet ook aan de eisen worden voldaan die aan de componenten van de technische infrastructuur zijn gesteld, zoals: eisen aan passieve en actieve netwerkcomponenten (ook multimedia), systeemsoftware (operating systemen en middleware), de netwerk(beheer)software, servers, server(beheer)software en storage.","Informatiebeveiliging :   Information Security Foundation based on ISO/IEC 27002\nServicemanagement :  ITSM Foundation; ITIL Foundation"]
["1.1.5 Systeem Architectuur ","De systeem architect is een rol die met name in het Scaled Agile Framework voorkomt. De systeem architect is verantwoordelijk voor het opstellen van de architectural features op programma niveau. De systeem architect overziet het gehele domein in technische zin. In die hoedanigheid is dit een belangrijke schakel tussen de product- of domeinvisie, en de benodigde aanpassingen aan het specifieke IV-landschap die realisatie van deze visie ondersteunt. Om te komen tot realisatie van de corporate doelen op het gebied van convergentie en ondersteunen van de strategie, vertaalt de systeem architect de corporate architectural epics in architectural features. Deze vult hij/zij aan met eventuele lokaal benodigde architectural features. De systeem architect is een belangrijke sparringpartner voor de product manager en product owners. De systeem architect zal moeten onderhandelen en bedingen welke architectural features gerealiseerd dienen te worden, alvorens de business features gerealiseerd kunnen worden. Vaak moet de fundering eerst worden versterkt, voordat er op voortgebouwd kan worden. Dit noemt SAFe de ‘architectural runway’. In deze hoedanigheid maakt de systeem architect deel uit van het product management team. ","Informatiebeveiliging :  Information Security Foundation based on ISO/IEC 27002\nServicemanagement :  ITSM Foundation; ITIL Foundation\nScaled Agile Framework :  SAFe Agilist, Leading SAFE Agile voor Lead engineers"]
{"$rows_left_out":57}
{"sheet":"Info VOG Items","index":4,"n_rows":43,"n_cols":2,"rows_kept":43,"cut":false,"hidden":false,"merged":[]}
[null,"VOG Overzicht Items"]
[]
[null,"Specifiek screeningsprofiel"]
["01","Politieke ambtsdragers"]
["06","Visum en emigratie"]
["25","(Buitengewoon) opsporingsambtenaar"]
{"$rows_left_out":38}
{"sheet":"Rapportage Info","index":5,"n_rows":12,"n_cols":12,"rows_kept":12,"cut":false,"hidden":true,"merged":[[0,0,0,2],[2,0,2,3],[3,0,3,3],[3,4,3,5]]}
["Rapportagegevens Inhuur ICT-Professionals Detavast",null,null,"Referentienummer",{"$f":"'Aanvraag inhuur'!D1","v":0}]
[]
["U kunt de ingevulde rubrieken overnemen (Kopiëren/Plakken) op uw rapportagewerkblad"]
["Voor vragen kunt u contact opnemen met de contractmanager bereikbaar via :",null,null,null,{"$f":"'Brongegevens dienst'!B20","v":"iuc-inhuur@iuc-noord.nl"}]
[]
["INFORMATIE VOOR RAPPORTAGE OPDRACHTNEMERS"]
{"$rows_left_out":7}
{"sheet":"Brongegevens dienst","index":6,"n_rows":40,"n_cols":26,"rows_kept":40,"cut":false,"hidden":true,"merged":[[0,17,0,23],[10,0,10,1],[0,0,0,1],[0,2,0,4],[0,7,0,16],[1,0,1,1],[9,0,9,1],[1,18,1,22]]}
["Aanvraagopties",null,"ORGANISATIE",null,null,null,null,"FEESTDAGEN",null,null,null,null,null,null,null,null,null,"LEVERANCIERSINFORMATIE"]
["Bij meerdere geschikte kandidaten behoudt de dienst zich het recht voor om meerdere gunningen te doen.",null,"Departement","Deelnemende dienst","Algemene tekst dienst","Emailadres Inhuurdesk","Pad","Jaar","1e Paasdag","2e Paasdag","Hemelvaartsdag","Koningsdag","1e Pinksterdag","2e Pinksterdag","1e Kerstdag","2e Kertsdag","Nieuwjaar","LevP1","Worden niet gebruikt door dienst. \nWel laten staan.",null,null,null,null,"Email-adres","JenV","OCW"]
[null,null,"Ministerie van Justitie en Veiligheid","Centraal Justitieel Incassobureau","Het CJIB is een relatief jonge en ambitieuze uitvoeringsorganisatie van het Ministerie van Justitie en Veiligheid, en is gevestigd te Leeuwarden. Ruim 1200 gedreven medewerkers zorgen ervoor dat onze taken op de juiste wijze, ondersteund door adequate ICT en binnen de beschikbare middelen worden uitgevoerd. De ICT-organisatie heeft een interne schil met de mogelijkheid flexibel bij te schakelen. Het CJIB werkt met DevOps-teams. Zij ontwikkelt en beheert hoogwaardige (ICT) producten. ","iuc-inhuur@iuc-noord.nl","K:\\5 Inkooptrajecten\\5.7 Inhuur\\ICT\\CJIB\\",2016,{"$f":"FIXED((\"4/\"&H3)/7+MOD(MOD(H3,19)*19-7,30)*14%,0)*7-6","v":42456},{"$f":"I3+1","v":42457},{"$f":"I3+39","v":42495},42487,{"$f":"I3+49","v":42505},{"$f":"I3+50","v":42506},{"$f":"DATE(H3,12,25)","v":42729},{"$f":"DATE(H3,12,26)","v":42730},{"$f":"DATE(H3,1,1)","v":42370},"Calco Group",null,null,null,null,null,null,"Centraal Justitieel Incassobureau","Bestuursdepartement OCW"]
[null,null,"Ministerie van Onderwijs, Cultuur en Wetenschap","Bestuursdepartement OCW","OCW bestaat uit een bestuursdepartement en tien daarbuiten gepositioneerde dienstonderdelen Het bestuursdepartement ontwikkelt het beleid op de terreinen onderwijs, cultuur en wetenschap. ","iuc-inhuur@iuc-noord.nl","K:\\5 Inkooptrajecten\\5.7 Inhuur\\ICT\\BD-EGI-CvTE\\",2017,{"$f":"FIXED((\"4/\"&H4)/7+MOD(MOD(H4,19)*19-7,30)*14%,0)*7-6","v":42841},{"$f":"I4+1","v":42842},{"$f":"I4+39","v":42880},42852,{"$f":"I4+49","v":42890},{"$f":"I4+50","v":42891},{"$f":"DATE(H4,12,25)","v":43094},{"$f":"DATE(H4,12,26)","v":43095},{"$f":"DATE(H4,1,1)","v":42736},"De Staffing Groep",null,null,null,null,null,null,null,"Dienst Uitvoering Onderwijs Den Haag"]
["Lijst 1","Lijst 2",null,"Dienst Uitvoering Onderwijs Den Haag","DUO verzorgt als uitvoeringsorganisatie, zijnde onderdeel van het Ministerie van Onderwijs, Cultuur en Wetenschap de uitvoering van complexe wet- en regelgeving en heeft een uitgebreid dienstenpakket. DUO financiert en informeert onderwijsdeelnemers en onderwijsinstellingen. Voor verdere informatie zie www.duo.nl","iuc-inhuur@iuc-noord.nl","K:\\5 Inkooptrajecten\\5.7 Inhuur\\ICT\\DUO-DH\\",2018,43191,43192,43230,43217,43240,43241,43459,43460,43101,"iSense",null,null,null,null,null,null,null,"Dienst Uitvoering Onderwijs Groningen"]
["Ja","Ja",null,"Dienst Uitvoering Onderwijs Groningen","DUO verzorgt als uitvoeringsorganisatie, zijnde onderdeel van het Ministerie van Onderwijs, Cultuur en Wetenschap de uitvoering van complexe wet- en regelgeving en heeft een uitgebreid dienstenpakket. DUO financiert en informeert onderwijsdeelnemers en onderwijsinstellingen. Voor verdere informatie zie www.duo.nl","iuc-inhuur@iuc-noord.nl","K:\\5 Inkooptrajecten\\5.7 Inhuur\\ICT\\DUO-G\\",2019,43576,43577,43615,null,43625,43626,43824,43825,43466,"YER Nederland",null,null,null,null,null,null,null,"Inspectie Overheidsinformatie en Erfgoed"]
{"$rows_left_out":34}