{"text_format":"1","workbook":"xlsx","n_sheets":8,"sheets":["Blad1","Aanvraag inhuur","Kwaliteitsraamwerk I(v)","Hulp bij invullen","Kwaliteitsraamwerk I(v) Info","Info VOG Items","Rapportage Info","Brongegevens dienst"],"not_rendered":{"charts":0,"images":3,"macros":1,"external_links":0,"defined_names":27,"comments":1,"pivot_tables":0},"unopened":[],"bounds":{"document_bytes":16777216,"sheet_cells":100000,"rows_first":2000,"rows_last":500,"rows_between":2000,"halvings":0,"cell_chars":16384,"cell_head_chars":4096},"cells_cut":0,"cells_raw":0,"read":"whole","date_system":"1900"}

{"sheet":"Blad1","index":0,"n_rows":0,"n_cols":0,"rows_kept":0,"cut":false,"hidden":true,"merged":[]}

{"sheet":"Aanvraag inhuur","index":1,"n_rows":155,"n_cols":14,"rows_kept":155,"cut":false,"hidden":false,"merged":[[48,0,48,8],[51,3,53,7],[59,2,59,7],[56,2,56,7],[4,3,6,7],[31,1,31,5],[40,2,40,7],[31,7,31,8],[16,1,16,2],[17,1,17,2],[18,1,18,2],[12,0,12,1],[8,3,10,8],[12,3,12,5],[12,6,12,7],[78,0,81,0],[82,7,83,7],[85,1,85,5],[86,1,86,5],[89,1,89,5],[78,2,78,7],[83,1,83,5],[84,1,84,5],[87,1,87,5],[88,1,88,5],[103,0,106,0],[112,7,117,7],[109,0,109,3],[112,3,115,3],[113,4,115,5],[0,3,0,5],[98,0,101,0],[93,0,96,0],[49,0,49,1],[55,2,55,7],[24,1,24,7],[26,1,26,7],[28,1,28,7],[29,1,29,7],[52,1,52,2],[53,1,53,2],[70,2,70,8],[68,1,68,7],[79,2,79,7],[80,2,80,7],[81,2,81,7],[77,2,77,7],[57,2,57,7],[112,6,117,6],[60,2,60,7],[103,1,106,7],[97,5,97,7],[93,1,96,7],[139,2,139,7],[135,5,135,6],[151,3,151,4],[133,3,133,7],[143,5,145,7],[143,3,145,4],[137,3,137,4],[135,3,136,4],[134,5,134,7],[136,5,137,6],[128,6,128,7],[128,3,128,5],[131,1,131,2],[132,3,132,4],[132,5,132,7],[130,3,130,7],[131,3,131,8],[2,3,2,5],[123,2,123,7],[121,2,121,7],[116,3,117,3],[123,0,123,1],[121,0,121,1],[98,1,101,7],[50,3,50,7],[58,2,58,7],[62,1,62,7],[72,2,72,7],[73,2,73,7],[74,2,74,7],[71,2,71,7],[64,1,64,7],[75,2,75,7]]}
["Inhuurformulier Inhuur ICT-Professionals",null,"Referentienummer\n(wordt ingevuld door inhuurdesk)",null,null,null,null,{"$f":"'Brongegevens dienst'!B12","v":"5.6"}]
[{"$f":"CONCATENATE(\"AV\",D1)","v":"AV"},{"$f":"VLOOKUP(B18,'Brongegevens dienst'!D3:G3,4,FALSE)","v":"K:\\5 Inkooptrajecten\\5.7 Inhuur\\ICT\\CJIB\\"},{"$f":"CONCATENATE(\"RI\",D1)","v":"RI"},null,null,null,{"$f":"'Brongegevens dienst'!A10","v":"K:\\5 Inkooptrajecten\\5.7 Inhuur\\ICT\\CJIB\\"},null,{"$f":"'Brongegevens dienst'!A10","v":"K:\\5 Inkooptrajecten\\5.7 Inhuur\\ICT\\CJIB\\"}]
[null,null,"Capaciteitsaanvraagnummer CJIB",null,null,null,null,"!IUC-N",{"$f":"CONCATENATE(\"AV\",D1)","v":"AV"}]
["Soort minicompetitie*","Zonder leiding en toezicht",{"$f":"IF(B4=\"Perceel 1\", \"Soort1\",\"Soort2\")","v":"Soort2"},null,null,null,null,null,{"$f":"'Brongegevens dienst'!A12","v":"Versienummer formulier"}]
["Type Aanvraag*","Regulier","è Toelichting  aanvraag",null,null,null,null,null,{"$f":"'Brongegevens dienst'!A10","v":"K:\\5 Inkooptrajecten\\5.7 Inhuur\\ICT\\CJIB\\"}]
["Eventueel maximum uurtarief"]
{"$rows_left_out":150}
{"sheet":"Kwaliteitsraamwerk I(v)","index":2,"n_rows":65,"n_cols":33,"rows_kept":65,"cut":false,"hidden":true,"merged":[]}
["Hoofgroep","Plannen","Bouwen","Uitvoeren","Mogelijk maken","Sturen","Kwaliteitenprofielen","PK1","C1","PK2","C2","PK3","C3","PK4","C4","PK5","C5","PK6","C6","Functiefamilie 1","Functiegroep 1","Schaal 1","Competenties 1","Functiefamilie 2","Functiegroep 2","Schaal 2","Competenties 2","Functiefamilie 3","Functiegroep 3","Schaal 3","Competenties 3","Toelichting","Voorbeelden van opleidingen"]
["Plannen","1.1.1 INFORMATIEARCHITECTUUR","2.1.1 APPLICATIEONTWIKKELING","3.1.1 SYSTEEMBEHEER","4.1.1 SECURITY MANAGEMENT","5.1.1 PROJECTLEIDERSCHAP IV","1.1.1 INFORMATIEARCHITECTUUR","Bestuurlijke informatica","Diverse HBO- en WO-instellingen bieden deze bachelor en/of master aan","Architectuur (methoden, modelleer-technieken, tools, modellen, etc.)","TOGAF Practitioner; NORA; MARIJ (geen \ncertificering); SCIA, ERIA, basisopleiding \narchitectuur Belastingdienst; IDA (Defensie), \nArchimate Foundation & Practitioner","Informatiemanagement","Business Information Management Foundation"," "," "," "," "," "," ","Uitvoering","Expert IV","S11-13","analyseren, creativiteit, netwerken, omgevingsbewustzijn, organisatiesensitiviteit, overtuigingskracht, plannen en organiseren, resultaatgerichtheid","Bedrijfsvoering","Senior Adviseur Bedrijfsvoering","S11-13","analyseren, creativiteit, netwerken, omgevingsbewustzijn, organisatiesensitiviteit, overtuigingskracht, plannen en organiseren"," "," "," "," ","De informatiearchitectuur richt zich op de beschrijving van de inhoudelijk relaties en samenhang tussen toepassingen en gegevensverzamelingen onderling. Het opstellen, beheren en integreren van de structuur van applicaties, databases en andere (data)gegevensverzamelingen. Ook in persoonlijke applicaties, zoals spreadsheets. Daarbij wordt gelet op eventueel gewijzigde informatiebehoeften van gebruikers. Daarnaast worden de beleidsregels voor het beheer van de (elementen van de) informatiearchitectuur opgesteld. Hoewel het vakgebied datamanagement meestal verantwoordelijk is voor het beheer van het bedrijfsdatamodel, wordt dit voor de invulling van dit model vaak bij data- of informatiearchitectuur (KWIV 1.1.3) belegd.","Informatiebeveiliging :  Information Security Foundation based on ISO/IEC 27002\nOntwikkeling informatiesystemen :  Ontwikkeling Informatiesystemen Foundation"]
["Bouwen","1.1.2 FUNCTIONEEL ONTWERP/STARTARCHITECTUUR","2.1.2 SYSTEEMONTWIKKELING","3.1.2 CHANGE MANAGEMENT","4.1.2 INFORMATIERISICOMANAGEMENT","5.1.2 PROJECTMANAGEMENT IV","1.1.2 FUNCTIONEEL ONTWERP/STARTARCHITECTUUR","Proces Modelleren en Analyseren","ARIS; Mavin, BiZZ designer","Bedrijfsregels modelleren","Business Rules Modeling Foundation Course"," "," "," "," "," "," "," "," ","Uitvoering","Senior Medewerker IV","S8-11","analyseren, klantgerichtheid, omgevingsbewustzijn, plannen en organiseren, resultaatgerichtheid, samenwerken, voortgangscontrole, zelfontwikkeling","Bedrijfsvoering","Adviseur Bedrijfsvoering","S8-11","analyseren, klantgerichtheid, omgevingsbewustzijn, plannen en organiseren, samenwerken, voortgangscontrole, zelfontwikkeling"," "," "," "," ","Functioneel ontwerp/ startarchitectuur richt zich op het beschrijven van wat het informatiesysteem moet kunnen. Samen met (eind)gebruikers en de opdrachtgever worden functionele specificaties opgesteld, waaraan een informatiesysteem moet voldoen. Het ontwerp wordt (mede) op basis van de input vanuit vakgebieden informatieanalyse (KWIV 4.3.1) en/of business analyse (KWIV 4.3.2) gemaakt. Het gaat om het analyseren, modelleren en specifiek de eisen aan informatie bij de gebruikers vaststellen. Het beheer en onderhoud van een informatiesysteem ligt meestal bij functioneel beheer en/of applicatiebeheer. Vanuit functioneel ontwerp/ startarchitectuur wordt ook een bijdrage aan testplannen voor functionele en acceptatietesten geleverd. ","Architectuur :  NORA, MARIJ (geen certificering)\nOntwikkeling van informatiesystemen :  Ontwerp en Ontwikkeling Informatiesystemen, Foundation; RAD/LAD; XML/UML; XBRL\nProgrammeren :  Java; C#; .Net; Visual Basic; SAP/ERP; Cobol; Python; PHP\nGegevensmodellering :  Oracle; Databases en SQL Foundation; Objectoriëntatie Foundation\nTesten :  Testen Foundation; TMapNEXT Foundation"]
["Uitvoeren","1.1.3 APPLICATIEARCHITECTUUR","2.1.3 NETWERKONTWIKKELING","3.1.3 FUNCTIONEEL BEHEER","4.1.3 CYBERSECURITY MANAGEMENT","5.1.3 PROGRAMMAMANAGEMENT IV","1.1.3 APPLICATIEARCHITECTUUR","Bestuurlijke informatica","Bachelor Bedrijfskundige Informatica","Architectuur (methoden, modelleer-technieken, tools, modellen, etc.)","TOGAF Practitioner; NORA; MARIJ (geen certificering); ERIA, basisopleiding architectuur \nBelastingdienst; IDA (Defensie) Archimate\nFoundation & Practitioner","Informatiemanagement","Business Information Management Foundation"," "," "," "," "," "," ","Uitvoering","Expert IV","S11-13","analyseren, creativiteit, netwerken, omgevingsbewustzijn, organisatiesensitiviteit, overtuigingskracht, plannen en organiseren, resultaatgerichtheid","Bedrijfsvoering","Senior Adviseur Bedrijfsvoering","S11-13","analyseren, creativiteit, netwerken, omgevingsbewustzijn, organisatiesensitiviteit, overtuigingskracht, plannen en organiseren"," "," "," "," ","Applicatiearchitectuur richt zich op het beschrijven van de samenhang van de applicaties en informatiesystemen binnen de organisatie. Het modelmatig beschrijven van het applicatielandschap (de daadwerkelijk systemen in productie). Daarbij wordt vanuit de principes van onder meer Nora, Gemma, et cetera gewerkt. Dit vakgebied komt vooral voor in organisaties waar grote en complexe systemen worden ontwikkeld. Tevens bij de ontwikkeling van administratieve applicaties en embedded software (software geschreven om machines en apparaten te besturen). Vaak is applicatiearchitectuur sterk verbonden met informatiearchitectuur (KWIV 1.1.1).","Programmeren :   Java; C#; .Net; Visual Basic; SAP/ERP; Groupware/Lotus Notes; Powerbuil\u0002der/Sybase; Cobol/Cics/DB2; Cool Gen\nInformatiebeveiliging :  Information Security Foundation based on ISO/IEC 27002\nOntwikkeling informatiesystemen :  Ontwikkeling Informatiesystemen Foundation\nApplicatiemanagement :  Applicatiemanagement Foundation"]
["Mogelijk maken","1.1.4 TECHNISCHE ARCHITECTUUR","2.1.4 DATA ENGINEERING","3.1.4 SERVERBEHEER","4.2.1 CATEGORIEMANAGEMENT IV","5.1.4 PORTFOLIOMANAGEMENT IV","1.1.4 TECHNISCHE ARCHITECTUUR","Bestuurlijke Informatica","Bachelor Bedrijfskundige Informatica","Architectuur (methoden, modelleer-technieken, tools, modellen, etc.)","TOGAF Practitioner; NORA; MARIJ (geen \ncertificering); SCIA, ERIA, basisopleiding \narchitectuur Belastingdienst; IDA (Defensie) Archimate Foundation & Practitioner","Informatiemanagement","Business Information Management Foundation","Servicemanagement","Professional ITSM Service Delivery"," "," "," "," ","Uitvoering","Expert IV","S11-13","analyseren, creativiteit, netwerken, omgevingsbewustzijn, organisatiesensitiviteit, overtuigingskracht, plannen en organiseren, resultaatgerichtheid","Bedrijfsvoering","Senior Adviseur Bedrijfsvoering","S11-13","analyseren, creativiteit, netwerken, omgevingsbewustzijn, organisatiesensitiviteit, overtuigingskracht, plannen en organiseren"," "," "," "," ","Technische architectuur richt zich op het beschrijven van de principes, richtlijnen en regels om de informatiesystemen te laten werken. De focus is om de overkoepelende structuur van de technische infrastructuur te ontwerpen. Dit zijn netwerk, servers en storage (opslag). De technische infrastructuur moet worden gebaseerd op de informatiearchitectuur (KWIV 1.1.1), het automatiseringsbeleid en de automatiseringsplannen. Hierbij wordt niet alleen een structuur ontworpen, maar er wordt ook gecontroleerd of aan de gestelde eisen wordt voldaan. Bijvoorbeeld eisen aan passieve en actieve netwerkcomponenten (ook multimedia), systeemsoftware (operating systemen en middleware), de netwerk(beheer)software, servers, server(beheer)software en storage.","Informatiebeveiliging :   Information Security Foundation based on ISO/IEC 27002\nServicemanagement :  ITSM Foundation; ITIL Foundation"]
["Sturen","1.1.5 SYSTEEMARCHITECTUUR","2.2.1 TESTMANAGEMENT","3.1.5 NETWERKBEHEER","4.2.2 INKOOP IV","5.2.1 SCRUM MASTER","1.1.5 SYSTEEMARCHITECTUUR","Bestuurlijke Informatica","Bachelor Bedrijfskundige Informatica","Architectuur (methoden, modelleer-technieken, tools, modellen, etc.)","TOGAF Practitioner; NORA; MARIJ (geen certificering); SCIA, ERIA, basisopleiding \narchitectuur Belastingdienst; IDA (Defensie) \nArchimate Foundation & Practitioner","Informatiemanagement","Business Information Management Foundation","Servicemanagement","Professional ITSM Service Delivery"," "," "," "," ","Uitvoering","Expert IV","S11-13","analyseren, creativiteit, netwerken, omgevingsbewustzijn, organisatiesensitiviteit, overtuigingskracht, plannen en organiseren, resultaatgerichtheid","Bedrijfsvoering","Senior Adviseur Bedrijfsvoering","S11-13","analyseren, creativiteit, netwerken, omgevingsbewustzijn, organisatiesensitiviteit, overtuigingskracht, plannen en organiseren"," "," "," "," ","Systeemarchitectuur richt zich op het beschrijven van een conceptueel model dat de structuur, het gedrag en de weergave van een systeem definieert. Hierbij wordt er rekening gehouden met beveiliging, audits, de prestaties en de uitwisseling van gegevens met externe bronnen of bestemmingen. Systeemarchitectuur overziet het gehele domein in technische zin. De schakel tussen de product- of domeinvisie, en de benodigde aanpassingen aan het specifieke IV-landschap. Binnen het Scaled Agile Framework is systeemarchitectuur verantwoordelijk voor het opstellen van de 'architectural features' op programmaniveau. De systeeminfrastructuur moet passen binnen de informatiearchitectuur (KWIV 1.1.1), het automatiseringsbeleid en de automatiseringsplannen. Hierbij is systeemarchitectuur een belangrijke sparringpartner voor de product manager (KWIV 4.5.2) en product owners (KWIV 4.5.1). Vaak maakt systeemarchitectuur deel uit van het productmanagementteam. ","Informatiebeveiliging :  Information Security Foundation based on ISO/IEC 27002\nServicemanagement :  ITSM Foundation; ITIL Foundation\nScaled Agile Framework :  SAFe Agilist, Leading SAFE Agile voor Lead engineers"]
{"$rows_left_out":60}
{"sheet":"Hulp bij invullen","index":3,"n_rows":26,"n_cols":8,"rows_kept":26,"cut":false,"hidden":false,"merged":[[12,2,19,5],[4,7,10,8],[21,2,23,5],[25,2,26,5],[0,0,0,1],[4,2,5,5],[7,2,10,5]]}
["Aanvragen juist in de markt plaatsen"]
[]
["1. Enkelvoudige reguliere aanvraag  zonder extra opties?",null,"Ga naar stap 3",null,null,null,null,"Niet doen bij het invullen van aanvragen ICT Inhuur!!"]
[]
["2. Meerdere FTE's nodig?",null,"In negen van de tien gevallen gewoon als reguliere aanvraag zonder extra opties. \n\nLet wel op dat de eisen in proportie blijven (werk en denkniveau i.p.v. diploma, aantal jaren ervaring van iemand die iets dedicated heeft gedaan kan lager. Vermijdt ook ervaringseisen gerelateerd aan een specifieke klant). ",null,null,null,null,"Teveel Fte’s op 1 aanvraag. Geef leveranciers de ruimte meer cv’s in te dienen en voeg de regel toe: ‘in geval meerdere kandidaten geschikt worden bevonden, behoudt de dienst zich het recht voor meerdere gunningen te doen.’\n\nOp de aanvraag aangeven dat het om een aangewezen / gerede kandidaat of warme stoel gaat. De ADR verklaart dit onrechtmatig!\n\nVerambtelijken zonder de nog lopende nok te respecteren!\n\nWensen als eis opnemen! Bijv. Bij voorkeur heeft de kandidaat…. Dit suggereert een wens en moet dan ook als wens worden genoteerd.\n\nTelefonisch toelichting geven aan een opdrachtnemer zonder dit ook te delen met de andere opdrachtnemers."]
[]
{"$rows_left_out":21}
{"sheet":"Kwaliteitsraamwerk I(v) Info","index":4,"n_rows":65,"n_cols":3,"rows_kept":65,"cut":false,"hidden":false,"merged":[]}
["Kwaliteitenprofielen","Toelichting","Voorbeelden van opleidingen"]
["1.1.1 INFORMATIEARCHITECTUUR","De informatiearchitectuur richt zich op de beschrijving van de inhoudelijk relaties en samenhang tussen toepassingen en gegevensverzamelingen onderling. Het opstellen, beheren en integreren van de structuur van applicaties, databases en andere (data)gegevensverzamelingen. Ook in persoonlijke applicaties, zoals spreadsheets. Daarbij wordt gelet op eventueel gewijzigde informatiebehoeften van gebruikers. Daarnaast worden de beleidsregels voor het beheer van de (elementen van de) informatiearchitectuur opgesteld. Hoewel het vakgebied datamanagement meestal verantwoordelijk is voor het beheer van het bedrijfsdatamodel, wordt dit voor de invulling van dit model vaak bij data- of informatiearchitectuur (KWIV 1.1.3) belegd.","Informatiebeveiliging :  Information Security Foundation based on ISO/IEC 27002\nOntwikkeling informatiesystemen :  Ontwikkeling Informatiesystemen Foundation"]
["1.1.2 FUNCTIONEEL ONTWERP/STARTARCHITECTUUR","Functioneel ontwerp/ startarchitectuur richt zich op het beschrijven van wat het informatiesysteem moet kunnen. Samen met (eind)gebruikers en de opdrachtgever worden functionele specificaties opgesteld, waaraan een informatiesysteem moet voldoen. Het ontwerp wordt (mede) op basis van de input vanuit vakgebieden informatieanalyse (KWIV 4.3.1) en/of business analyse (KWIV 4.3.2) gemaakt. Het gaat om het analyseren, modelleren en specifiek de eisen aan informatie bij de gebruikers vaststellen. Het beheer en onderhoud van een informatiesysteem ligt meestal bij functioneel beheer en/of applicatiebeheer. Vanuit functioneel ontwerp/ startarchitectuur wordt ook een bijdrage aan testplannen voor functionele en acceptatietesten geleverd. ","Architectuur :  NORA, MARIJ (geen certificering)\nOntwikkeling van informatiesystemen :  Ontwerp en Ontwikkeling Informatiesystemen, Foundation; RAD/LAD; XML/UML; XBRL\nProgrammeren :  Java; C#; .Net; Visual Basic; SAP/ERP; Cobol; Python; PHP\nGegevensmodellering :  Oracle; Databases en SQL Foundation; Objectoriëntatie Foundation\nTesten :  Testen Foundation; TMapNEXT Foundation"]
["1.1.3 APPLICATIEARCHITECTUUR","Applicatiearchitectuur richt zich op het beschrijven van de samenhang van de applicaties en informatiesystemen binnen de organisatie. Het modelmatig beschrijven van het applicatielandschap (de daadwerkelijk systemen in productie). Daarbij wordt vanuit de principes van onder meer Nora, Gemma, et cetera gewerkt. Dit vakgebied komt vooral voor in organisaties waar grote en complexe systemen worden ontwikkeld. Tevens bij de ontwikkeling van administratieve applicaties en embedded software (software geschreven om machines en apparaten te besturen). Vaak is applicatiearchitectuur sterk verbonden met informatiearchitectuur (KWIV 1.1.1).","Programmeren :   Java; C#; .Net; Visual Basic; SAP/ERP; Groupware/Lotus Notes; Powerbuil\u0002der/Sybase; Cobol/Cics/DB2; Cool Gen\nInformatiebeveiliging :  Information Security Foundation based on ISO/IEC 27002\nOntwikkeling informatiesystemen :  Ontwikkeling Informatiesystemen Foundation\nApplicatiemanagement :  Applicatiemanagement Foundation"]
["1.1.4 TECHNISCHE ARCHITECTUUR","Technische architectuur richt zich op het beschrijven van de principes, richtlijnen en regels om de informatiesystemen te laten werken. De focus is om de overkoepelende structuur van de technische infrastructuur te ontwerpen. Dit zijn netwerk, servers en storage (opslag). De technische infrastructuur moet worden gebaseerd op de informatiearchitectuur (KWIV 1.1.1), het automatiseringsbeleid en de automatiseringsplannen. Hierbij wordt niet alleen een structuur ontworpen, maar er wordt ook gecontroleerd of aan de gestelde eisen wordt voldaan. Bijvoorbeeld eisen aan passieve en actieve netwerkcomponenten (ook multimedia), systeemsoftware (operating systemen en middleware), de netwerk(beheer)software, servers, server(beheer)software en storage.","Informatiebeveiliging :   Information Security Foundation based on ISO/IEC 27002\nServicemanagement :  ITSM Foundation; ITIL Foundation"]
["1.1.5 SYSTEEMARCHITECTUUR","Systeemarchitectuur richt zich op het beschrijven van een conceptueel model dat de structuur, het gedrag en de weergave van een systeem definieert. Hierbij wordt er rekening gehouden met beveiliging, audits, de prestaties en de uitwisseling van gegevens met externe bronnen of bestemmingen. Systeemarchitectuur overziet het gehele domein in technische zin. De schakel tussen de product- of domeinvisie, en de benodigde aanpassingen aan het specifieke IV-landschap. Binnen het Scaled Agile Framework is systeemarchitectuur verantwoordelijk voor het opstellen van de 'architectural features' op programmaniveau. De systeeminfrastructuur moet passen binnen de informatiearchitectuur (KWIV 1.1.1), het automatiseringsbeleid en de automatiseringsplannen. Hierbij is systeemarchitectuur een belangrijke sparringpartner voor de product manager (KWIV 4.5.2) en product owners (KWIV 4.5.1). Vaak maakt systeemarchitectuur deel uit van het productmanagementteam. ","Informatiebeveiliging :  Information Security Foundation based on ISO/IEC 27002\nServicemanagement :  ITSM Foundation; ITIL Foundation\nScaled Agile Framework :  SAFe Agilist, Leading SAFE Agile voor Lead engineers"]
{"$rows_left_out":60}
{"sheet":"Info VOG Items","index":5,"n_rows":43,"n_cols":2,"rows_kept":43,"cut":false,"hidden":false,"merged":[]}
[null,"VOG Overzicht Items"]
[]
[null,"Specifiek screeningsprofiel"]
["01","Politieke ambtsdragers"]
["06","Visum en emigratie"]
["25","(Buitengewoon) opsporingsambtenaar"]
{"$rows_left_out":38}
{"sheet":"Rapportage Info","index":6,"n_rows":12,"n_cols":16,"rows_kept":12,"cut":false,"hidden":true,"merged":[[0,0,0,2],[2,0,2,3],[3,0,3,3],[3,4,3,5]]}
["Rapportagegegevens Inhuur Aanvraag ICT",null,null,"Referentienummer",{"$f":"'Aanvraag inhuur'!D1","v":0}]
[]
["U kunt de ingevulde rubrieken overnemen (Kopiëren/Plakken) op uw rapportagewerkblad"]
["Voor vragen kunt u contact opnemen met de contractmanager bereikbaar via :",null,null,null,{"$f":"'Brongegevens dienst'!B20","v":"iuc-inhuur@iuc-noord.nl"}]
[]
["INFORMATIE VOOR RAPPORTAGE OPDRACHTNEMERS"]
{"$rows_left_out":7}
{"sheet":"Brongegevens dienst","index":7,"n_rows":42,"n_cols":24,"rows_kept":42,"cut":false,"hidden":true,"merged":[[22,0,34,1],[0,17,0,23],[10,0,10,1],[0,0,0,1],[0,2,0,4],[0,7,0,16],[1,0,1,1],[9,0,9,1],[1,18,1,22]]}
["Aanvraagopties",null,"ORGANISATIE",null,null,null,null,"FEESTDAGEN",null,null,null,null,null,null,null,null,null,"LEVERANCIERSINFORMATIE"]
["Bij meerdere geschikte kandidaten behoudt CJIB zich het recht voor om meerdere gunningen te doen.",null,"Departement","Deelnemer","Directie/Bedrijfsonderdeel\n(sorteer A-Z)","Emailadres Inhuurdesk","Pad","Jaar","1e Paasdag","2e Paasdag","Hemelvaartsdag","Koningsdag","1e Pinksterdag","2e Pinksterdag","1e Kerstdag","2e Kertsdag","Nieuwjaar","Naam (sorteren!)","Worden niet gebruikt door dienst. \nWel laten staan.",null,null,null,null,"Email-adres"]
[null,null,"Ministerie van Justitie & Veiligheid","CJIB","Bedrijfsvoering","iuc-inhuur@iuc-noord.nl","K:\\5 Inkooptrajecten\\5.7 Inhuur\\ICT\\CJIB\\",2016,{"$f":"FIXED((\"4/\"&H3)/7+MOD(MOD(H3,19)*19-7,30)*14%,0)*7-6","v":42456},{"$f":"I3+1","v":42457},{"$f":"I3+39","v":42495},42487,{"$f":"I3+49","v":42505},{"$f":"I3+50","v":42506},{"$f":"DATE(H3,12,25)","v":42729},{"$f":"DATE(H3,12,26)","v":42730},{"$f":"DATE(H3,1,1)","v":42370},"Cegeka"]
[null,null,null,null,"CTO Office",null,null,2017,{"$f":"FIXED((\"4/\"&H4)/7+MOD(MOD(H4,19)*19-7,30)*14%,0)*7-6","v":42841},{"$f":"I4+1","v":42842},{"$f":"I4+39","v":42880},42852,{"$f":"I4+49","v":42890},{"$f":"I4+50","v":42891},{"$f":"DATE(H4,12,25)","v":43094},{"$f":"DATE(H4,12,26)","v":43095},{"$f":"DATE(H4,1,1)","v":42736},"Cimsolutions"]
["Lijst 1","Lijst 2",null,null,"Dienstverlening & Incasso",null,null,2018,43191,43192,43230,43217,43240,43241,43459,43460,43101,"Circle8"]
["Ja","Ja",null,null,"Executie",null,null,2019,43576,43577,43615,null,43625,43626,43824,43825,43466,"Get There"]
{"$rows_left_out":36}